قضیه رنگ‌آمیزی نقشه
preferred label: map colour theorem @en
type: Concept
narrower: مسئله دوازده رنگ

مسئله دوازده رنگ
scope note: 12 رنگ برای رنگ آمیزی نقشه ای که در آن هر کشور حداکثر یک مستعمره دارد کافی است و اثبات اینکه چنین نقشه ای وجود دارد.
broader: قضیه رنگ‌آمیزی نقشه
preferred label: twelve color problem @en
type: Concept