حدس بوچت
scope note: هرگراف دوجهتی که یک جریان هیچ‌جا صفر بپذیرد،یک 6-جریان دوجهتی هیچ‌جا صفر میپذیرد.
broader: شبکه جریان
preferred label: Bouchet conjecture @en
type: Concept

شبکه جریان
preferred label: flow network @en
type: Concept
narrower: حدس بوچت