گراف برون مسطح
alternative label: گراف برون هامنی
scope note: گرافی که دارای یک گسترش در صفحه است که هر راس در یک وجه بیکران کشیده می شود.
broader: گراف مسطح
preferred label: outerplanar graph @en
type: Concept

گراف مسطح
preferred label: planar graph @en
type: Concept
narrower: گراف برون مسطح