زیرتقسیم گراف
scope note: با جایگزین کردن هر یال گراف اولیه با مسیرهایی از طول حداقل 2 بدست می آید.
related: انقباض گراف
broader: مینور گراف
preferred label: subdivision of graph @en
type: Concept

انقباض گراف
preferred label: contraction of graph @en
type: Concept
related: زیرتقسیم گراف

مینور گراف
preferred label: graph minor @en
type: Concept
narrower: زیرتقسیم گراف