ضخامت کتاب گراف
scope note: کوچکترین nای که گراف در درnصفحه نشانده میشود.
broader: n-کتاب
preferred label: book thickness of graph @en
type: Concept

n-کتاب
preferred label: n-book @en
type: Concept
narrower: ضخامت کتاب گراف