روند خطی
scope note: نخستین گام در تحلیل یک سری زمانی برای تعیین اینکه رابطه ای خطی، تقریب خوبی از حرکت دراز مدت سری به دست می دهد یا نه.
related: روش کمترین توان‌های دوم
broader: تحلیل سری با روند
preferred label: linear trend @en
type: Concept

روش کمترین توان‌های دوم
preferred label: least squares method @en
type: Concept
related: روند خطی

تحلیل سری با روند
preferred label: series analysis with trend @en
type: Concept
narrower: روند خطی