رویه ریمان
preferred label: Riemann surface @en
type: Concept
narrower: گروه فوکسی

گروه فوکسی
scope note: یک گروه کلاینی G که برای آن ناحیه D ای در صفحه مختلط وجود دارد که مرکب از درون یک دایره یا بخشی از صفحه در یک طرف یک خط راست است به طوری که D به وسیله هر عضو G به روی خودش نگاشته می شود.
broader: رویه ریمان
preferred label: Fuchsian group @en
type: Concept