نظریه تابع هندسی
preferred label: geometric function theory @en
type: Concept
narrower: اندازه همساز

اندازه همساز
scope note: فرض کنیم D دامنه ای در صفحه مختلط باشد که محدود به تعدادی متناهی خم ژوردان J است و نیز فرض کنیم J اجتماع کمان های ژوردان مجزای a و b باشد؛ اندازه همساز a نسبت به D تابع همسازی روی D است که مقدار یک روی a و مقدار صفر روی b اختیار می کند.
broader: نظریه تابع هندسی
preferred label: harmonic measure @en
type: Concept