فرمول شوارتس-کریستوفل
scope note: تبدیل‌های مختلطی که درون یک چندضلعی مفروض را به طور همدیس به روی بخشی از صفحه مختلط که در بالای محور حقیقی است، می‌نگارند.
related: معادله دیفرانسیل
broader: نظریه کلاسیک نگاشت‌های همدیس
preferred label: Schwartz-Christoffel formula @en
type: Concept

معادله دیفرانسیل
preferred label: differential equation @en
type: Concept
related: فرمول شوارتس-کریستوفل

نظریه کلاسیک نگاشت‌های همدیس
preferred label: classic theory of conformal mappings @en
type: Concept
narrower: فرمول شوارتس-کریستوفل