چندجمله‌ای هورویتس
scope note: نوعی چندجمله ای که همه صفرهای آن دارای قسمت های حقیقی منفی می باشند.
broader: ویژگی کلاسیک
preferred label: Hurwitz polynomial @en
type: Concept

ویژگی کلاسیک
preferred label: classical property @en
type: Concept
narrower: چندجمله‌ای هورویتس