اصول موضوع تفکیک
preferred label: separation axioms @en
type: Concept
narrower: اصل موضوع تفکیک هاسدورف

اصل موضوع تفکیک هاسدورف
alternative label: اصل موضوع جداسازی هاسدورف
scope note: هر دو نقطه متمایز در فضای توپولوژیک، همسایگی های جدا از هم دارند.
broader: اصول موضوع تفکیک
preferred label: Hausdorff separation axiom @en
type: Concept