اصول موضوع شمارایی
preferred label: countability axioms @en
type: Concept
related: فضای دنباله‌ای فشرده

فضای فشرده
preferred label: compact space @en
type: Concept
narrower: فضای دنباله‌ای فشرده

فضای دنباله‌ای فشرده
scope note: فضایی توپولوژیک با این ویژگی که هر دنباله متشکل از نقاطش زیردنباله ای دارد که به نقطه ای در آن فضا همگراست.
related: اصول موضوع شمارایی
broader: فضای فشرده
preferred label: sequential compact space @en
type: Concept