فضای توپولوژیک
preferred label: topological space @en
type: Concept
narrower: فضای کولموگوروف

فضای کولموگوروف
alternative label: فضای T0
scope note: فضای توپولوژیک، که در آن به ازای هر دو نقطه دست کم یکی از آنها همسایگی ای دارد که شامل دیگری نیست.
broader: فضای توپولوژیک
preferred label: Kolmogorov space @en
type: Concept