فضای توپولوژیک
preferred label: topological space @en
type: Concept
related: فضاهای همسان‌ریخت

فضاهای همسان‌ریخت
scope note: فضاهایی که هریک ازآنها را بتوان با کشیدن، فشردن، چرخاندن از دیگری به دست آورد.
related: فضای توپولوژیک
broader: همسان‌ریختی
preferred label: homeomorphic spaces @en
type: Concept

همسان‌ریختی
preferred label: homeomorphism @en
type: Concept
narrower: فضاهای همسان‌ریخت