گره
preferred label: knot @en
type: Concept
narrower: گره هذلولوی

گره هذلولوی
scope note: گرهی است که متمم آن یک منیفلد سه‌بعدی هذلولوی است. حجم هذلولوی این گره برابر با حجم متمم آن است.
broader: گره
preferred label: hyperbolic knot @en
type: Concept