همئوتوپی
preferred label: hometopy @en
type: Concept
narrower: گروه همئوتوپی

گروه همئوتوپی
scope note: گروه هموتوپی یک فضای توپولوژیک , یک گروه هوموتوپی از گروه خود همسان ریختی های آن فضاست.
broader: همئوتوپی
preferred label: homeotopy group @en
type: Concept