احتمال شرطی
preferred label: conditional probability @en
type: Concept
related: قاعده بیز

آمار بیزی
preferred label: Bayesian statistics @en
type: Concept
narrower: قاعده بیز

قاعده بیز
scope note: قاعده ای از میان چند راهبرد انتخاب شده موجود که بازده آن بیشترین مقدار مورد انتظار را دارد
related: احتمال شرطی
broader: آمار بیزی
preferred label: Bayes rule @en
type: Concept