احتمال شرطی
preferred label: conditional probability @en
type: Concept
related: قضیه بیز

قضیه بیز
alternative label: اصل احتمال وارون
scope note: احتمال اینکه یک فرض با در دست بودن داده های اولیه و داده هایی جدید، متناسب است با احتمال آن فرض با در دست بودن داده های اولیه به تنهایی و احتمال داده های جدید با در دست بودن داده های اولیه و آن فرض.
related: احتمال شرطی
broader: آمار بیزی
preferred label: Bayes theorem @en
type: Concept

آمار بیزی
preferred label: Bayesian statistics @en
type: Concept
narrower: قضیه بیز