جبر شرکت‌ناپذیر
preferred label: non-associative algebra @en
type: Concept
narrower: اتحاد ژوردان

جبر ژوردان
preferred label: Jordan algebra @en
type: Concept
related: اتحاد ژوردان

اتحاد ژوردان
scope note: برای دو عضو x , y از یک جبر رابطه زیر برقرار است: xyxy=xyxx
related: جبر ژوردان
broader: جبر شرکت‌ناپذیر
preferred label: Jordan identity @en
type: Concept