جبر عام
scope note: بررسی دستگاههایی جبری از قبیل گروهها، حلقه ها، مدولها و میدانها و تحقیق در مجموعه هایی از قضایا که در این دستگاهها مشابه اند.
related: گروه ان-تایی
broader: جبر
preferred label: universal algebra @en
type: Concept

گروه ان-تایی
preferred label: n-ary group @en
type: Concept
related: جبر عام

جبر
preferred label: algebra @en
type: Concept
narrower: جبر عام