تحلیل واریانس
preferred label: variance analysis @en
type: Concept
related: اف-آزمون

اف-آزمون
alternative label: آزمون نسبت واریانس
scope note: فنی است که برای مقایسۀ پراکندگی یا تغییرات در دو مجموعه از ارقام به کار می‌رود تا معلوم شود که آن دو مجموعه از ارقام از یک جامعه استخراج شده اند یا نه.
related: تحلیل واریانس
broader: آزمون
preferred label: f test @en
type: Concept

آزمون
preferred label: test @en
type: Concept
narrower: اف-آزمون