آزمون کولموگوروف-اسمیرنوف
scope note: شیوه ای برای اندازه گیری نیکویی برازش داده های نمونه به یک جامعۀ مشخص.
related: نیکویی برازش
broader: آزمون نیکویی برازش
preferred label: Kolmogorov-Smirnov test @en
type: Concept

نیکویی برازش
preferred label: goodness of fit @en
type: Concept
related: آزمون کولموگوروف-اسمیرنوف

آزمون نیکویی برازش
preferred label: goodness of fit test @en
type: Concept
narrower: آزمون کولموگوروف-اسمیرنوف