حلقه نیم‌ساده
preferred label: semi-simple ring @en
type: Concept
related: قضیه ودربرن

نظریه حلقه‌های تعویض‌نا‌پذیر
preferred label: non-commutative ring theory @en
type: Concept
narrower: قضیه ودربرن

قضیه ودربرن
scope note: یک حلقهَ آرتینی نیمساده جمع مستقیم تعداد متناهی حلقهَ آرتینی ساده است.
related: حلقه نیم‌ساده
broader: نظریه حلقه‌های تعویض‌نا‌پذیر
preferred label: Wedderburn theorem @en
type: Concept