تحلیل خوشه‌ای
preferred label: cluster analysis @en
type: Concept
narrower: قانون صفرویک کولموگوروف

قانون صفرویک کولموگوروف
scope note: احتمال اینکه یک خوشه نامتناهی وجود داشته باشد، صفر یا یک است.
broader: تحلیل خوشه‌ای
preferred label: Kolmogorov zero-one law @en
type: Concept