تحلیل چندمتغیره
preferred label: multivariate analysis @en
type: Concept
narrower: جدول پیشایندی

جدول پیشایندی
alternative label: جدول احتمالی
scope note: جدولی برای دسته بندی عناصر یک جامعه بر طبق دو متغیر که در آن سطرها متناظر با یک متغیر و ستون‌ها متناظر با یک متغیر دیگرند.
broader: تحلیل چندمتغیره
preferred label: contingency table @en
type: Concept