چولگی منفی
alternative label: چاولگی منفی
scope note: نوعی چاولگی که در آن میانگین کوچکتر از مد است.
broader: چولگی
preferred label: negative skew @en
type: Concept

چولگی
preferred label: skewness @en
type: Concept
narrower: چولگی منفی