چارک
preferred label: quartile @en
type: Concept
narrower: دامنه میان چارکی

دامنه میان چارکی
scope note: فاصلۀ بین بالای چارک پایین و پایین چارک بالای یک توزیع.
broader: چارک
preferred label: interquartile range @en
type: Concept