فراوانی خانه‌ای
scope note: تعداد مشاهدات مربوط به قیود شرطی مشخصی روی یک یا چند متغیر است.
broader: فراوانی
preferred label: cell frequency @en
type: Concept

فراوانی
preferred label: frequency @en
type: Concept
narrower: فراوانی خانه‌ای