فراوانی
preferred label: frequency @en
type: Concept
narrower: فراوانی رده

فراوانی رده
scope note: فراوانی ای که یک متغیر تصادفی مقادیر موجود در یک بازه رده ای مفروض را با آن فراوانی اختیار می کند.
broader: فراوانی
preferred label: class frequency @en
type: Concept