آخرین همانستگی موضعی
alternative label: آخرین کوهومولوژی موضعی
scope note: مدول همانستگی موضعی ناصفری که همۀ مدول های همانستگی موضعی بعد از آن صفر است.
related: قضیه صفرکننده گروتندیک
broader: همانستگی موضعی
preferred label: top local cohomology @en
type: Concept

قضیه صفرکننده گروتندیک
preferred label: Grothendieck vanishing theorem @en
type: Concept
related: آخرین همانستگی موضعی

همانستگی موضعی
preferred label: local cohomology @en
type: Concept
narrower: آخرین همانستگی موضعی