قضیه تعویض پایه یکدست
scope note: تانسور مدولهای کوهمولوژی موضعی یک مدول روی یک ایده آل حلقه، در یک جبر یکدست، با مدولهای کوهمولوژی موضعی آن مدول تانسور در آن جبر روی ایده آل توسیعی یکریخت است.
related: هم‌ریختی یکدست
broader: همانستگی موضعی
preferred label: flat base change theorem @en
type: Concept

هم‌ریختی یکدست
preferred label: flat homomorphism @en
type: Concept
related: قضیه تعویض پایه یکدست

همانستگی موضعی
preferred label: local cohomology @en
type: Concept
narrower: قضیه تعویض پایه یکدست