تابع
preferred label: function @en
type: Concept
narrower: تابع مرکب

عملگر ترکیب
preferred label: composition operator @en
type: Concept
related: تابع مرکب

تابع مرکب
scope note: تابعی از یک یا چند متغیر مستقل که خودشان توابعی از یک یا چند متغیر مستقل دیگرند.
related: عملگر ترکیب
broader: تابع
preferred label: composite function @en
type: Concept