آماره
preferred label: statistic @en
type: Concept
narrower: آماره اریب

آماره اریب
scope note: آماره ای که مقدار مورد انتظار آن که از یک نمونه گیری تصادفی به دست می آید برابر با پارامتر یا کمیتی که قرار است برآورد شود، نباشد.
broader: آماره
preferred label: biased statistic @en
type: Concept