نقطه عطف
scope note: نقطه ای که در آنجا حالت یک خم مسطح نسبت به یک خط ثابت از مقعر به محدب تغییر می کند نقطه ای که اگر تابع مشخص کننده خم دارای مشتق دوم باشد این مشتق در آن نقطه تغییر علامت می دهد.
related: مشتق
broader: نمودار تابع
preferred label: inflection point @en
type: Concept

مشتق
preferred label: derivative @en
type: Concept
related: نقطه عطف

نمودار تابع
preferred label: graph of a function @en
type: Concept
narrower: نقطه عطف