انتگرال
preferred label: integral @en
type: Concept
narrower: انتگرال حجمی

انتگرال حجمی
scope note: انتگرال تابعی چند متغیره نسبت به اندازه حجم که روی زیرمجموعه ای سه بعدی از دامنه تابع گرفته می شود.
related: تابع چندمتغیره
broader: انتگرال
preferred label: volume integral @en
type: Concept

تابع چندمتغیره
preferred label: multivariate function @en
type: Concept
related: انتگرال حجمی