برون چرخزاد
scope note: خم رسم شده به وسیله نقطه ای واقع بر یک دایره وقتی آن دایره در بیرون یک دایره ثابت مفروض و مماس بر آن می غلتد.
broader: خم
preferred label: epicycloid @en
type: Concept

خم
preferred label: curve @en
type: Concept
narrower: برون چرخزاد