درون چرخزاد
scope note: خم مسطحی حاصل از حرکت نقطه ای ثابت واقع بر یک دایره در حالی که این دایره در درون دایره دیگری و مماس بر آن می غلتد.
broader: خم
preferred label: hypocycloid @en
type: Concept

خم
preferred label: curve @en
type: Concept
narrower: درون چرخزاد