مارپیچ
preferred label: spiral @en
type: Concept
narrower: مارپیچ هذلولوی

مارپیچ هذلولوی
alternative label: مارپیچ وارون
scope note: خم مسطحی که درموردآن بردار شعاعی با زاویه قطبی تناسب معکوس دارد.
broader: مارپیچ
preferred label: hyperbolic spiral @en
type: Concept