پیوستگی
preferred label: continuity @en
type: Concept
narrower: قضیه مقدار میانی

قضیه مقدار میانی
scope note: اگر (f(x تابع پیوسته ی حقیقی مقداری روی بازه بسته a تا b باشد آنگاه به ازای هر k بین کوچکترین کران بالا و بزرگترین کران پایین مقادیر f عددی چون c بین a و b وجود دارد که ( k =f(c
related: روش نیوتن
broader: پیوستگی
preferred label: intermediate value theorem @en
type: Concept

روش نیوتن
preferred label: Newton method @en
type: Concept
related: قضیه مقدار میانی