ناپیوستگی جهتی
alternative label: انفصال جهتی
scope note: نقطه ای چون a که در آن برای یک تابع حقیقی مقدار (f(x ،حد چپ (f(x وقتی x به a میل می کند و نیز حد راست وجود دارند، ولی متمایزند.
broader: ناپیوستگی
preferred label: jump discontinuity @en
type: Concept

ناپیوستگی
preferred label: discontinuity @en
type: Concept
narrower: ناپیوستگی جهتی