توزیع توان دوم خی نامرکزی
alternative label: توزیع مربع خی نامرکزی
scope note: توزیع مجموع مربعات متغیرهای تصادفی نرمال مستقل که برای تعیین تابع توان آزمون خی دو به کار می رود.
broader: توزیع توان دوم خی
preferred label: non-central chi-square distribution @en
type: Concept

توزیع توان دوم خی
preferred label: chi-squared distribution @en
type: Concept
narrower: توزیع توان دوم خی نامرکزی