تابع بحرانی
scope note: تابعی که در معادلات اویلر در حساب وردش ها صدق می کند.
related: معادله اویلر
broader: حساب وردش
preferred label: critical function @en
type: Concept

معادله اویلر
preferred label: Euler equation @en
type: Concept
related: تابع بحرانی

حساب وردش
preferred label: calculus of variation @en
type: Concept
narrower: تابع بحرانی