نظریه نقطه زینی
preferred label: saddle point theory @en
type: Concept
narrower: روش نقطه زینی

روش نقطه زینی
scope note: توابع خاصی را می توان به ازای مقادیر بزرگ بوسیله فرمولی مجانبی تقریب زد که از یک سری تیلر حول نقطه ای زینی بدست می آید، گاهی روش تندترین کاهش نیز می گویند.
broader: نظریه نقطه زینی
preferred label: saddle point method @en
type: Concept