نظریه پسین
scope note: نظریه وابرریختی های(دیفئومورفیسم) به طور غیر یکنواخت هذلولوی.
related: وابرریختی
broader: دستگاه غیر یکنواخت هذلولوی
preferred label: Pesin theory @en
type: Concept

وابرریختی
preferred label: diffeomorphism @en
type: Concept
related: نظریه پسین

دستگاه غیر یکنواخت هذلولوی
preferred label: non-uniformly hyperbolic system @en
type: Concept
narrower: نظریه پسین