دستگاه دینامیکی با رفتار هذلولوی
preferred label: dynamical system with hyperbolic behavior @en
type: Concept
narrower: مدار هذلولوی

مدار هذلولوی
scope note: مدار هذلولوی یک مدار با مرکز گریزی بزرگتر از یک است.
broader: دستگاه دینامیکی با رفتار هذلولوی
preferred label: hyperbolic orbit @en
type: Concept