نقطه استثنایی
scope note: نقطه z را نقطه استثنایی برای نگاشت گویای R گوییم، اگر کوچکترین مجموعه کاملاً ناوردای شامل z متناهی باشد.
related: تابع گویا
broader: دستگاه دینامیکی هموار
preferred label: exceptional point @en
type: Concept

تابع گویا
preferred label: rational function @en
type: Concept
related: نقطه استثنایی

دستگاه دینامیکی هموار
preferred label: smooth dynamical system @en
type: Concept
narrower: نقطه استثنایی