توزیع درصد
alternative label: توزیع فراوانی نسبی
scope note: یک توزیع فراوانی که در آن فراوانی هر رده به صورت درصدی از فراوانی کل بیان می شود.
related: فراوانی نسبی
broader: توزیع آماری
preferred label: percentage distribution @en
type: Concept

فراوانی نسبی
preferred label: relative frequency @en
type: Concept
related: توزیع درصد

توزیع آماری
preferred label: statistical distribution @en
type: Concept
narrower: توزیع درصد