روش مجموع‌پذیری
preferred label: summability method @en
type: Concept
narrower: روش چزارو

روش چزارو
scope note: روشی برای انتساب مجموع به بعضی دنباله ها و سری های واگرا از طریق میانگین گیری از n جمله اول و گذار به حد.
broader: روش مجموع‌پذیری
preferred label: Cesaro method @en
type: Concept