توزیع ژیبرا
scope note: توزیع متغیری که لگاریتم آن یک توزیع نرمال دارد.
broader: توزیع آماری
preferred label: Gibrat distribution @en
type: Concept

توزیع آماری
preferred label: statistical distribution @en
type: Concept
narrower: توزیع ژیبرا