طرح چند امضایی چند وکالتی
preferred label: multi-proxy multi-signature scheme @en
type: Concept
narrower: طرح چند امضایی چند وکالتی عمومی

طرح چند امضایی چند وکالتی عمومی
scope note: در این دسته حضور همه ی افراد گروه های امضا کنندگان اصلی و وکلا برای وکالت دادن و تولید امضای وکالتی الزامی است.
broader: طرح چند امضایی چند وکالتی
preferred label: public multi-proxy multi-signature scheme @en
type: Concept